Target
Glycogen synthase kinase-3 beta
Ligand
BDBM50354770
Substrate
Meas. Tech.
ChEMBL_771509 (CHEMBL1837408)
IC50
16000±n/a nM
Citation
 Cociorva, OMLi, BNomanbhoy, TLi, QNakamura, ANakamura, KNomura, MOkada, KSeto, SYumoto, KLiyanage, MZhang, MCAban, ALeen, BSzardenings, AKRosenblum, JSKozarich, JWKohno, YShreder, KR Synthesis and structure-activity relationship of 4-quinolone-3-carboxylic acid based inhibitors of glycogen synthase kinase-3ß. Bioorg Med Chem Lett 21:5948-51 (2011)  
Target
Name:
Glycogen synthase kinase-3 beta
Synonyms:
GSK-3 beta GSK3B Glycogen synthase kinase 3 beta (GSK3B) Glycogen synthase kinase-3 beta (GSK-3B) Glycogen synthase kinase-3 beta (GSK3B) Glycogen synthase kinase-3beta (GSK3B) | Serine/threonine-protein kinase GSK3B
Type:
Enzyme
Mol. Mass.:
46756.38
Organism:
Homo sapiens (Human)
Description:
P49841
Residue:
420
  
Inhibitor
Name:
BDBM50354770
Synonyms:
CHEMBL1834321
Type:
Small organic molecule
Emp. Form.:
C23H28FN5O4
Mol. Mass.:
457.4979
SMILES:
COc1c(NCCNc2ccccn2)c(F)c(N)c2c1n(CCC(C)C)cc(C(O)=O)c2=O
: