Target
Glucocorticoid receptor
Ligand
BDBM50354851
Substrate
Meas. Tech.
ChEMBL_772356 (CHEMBL1838801)
EC50
0.49±n/a nM
Citation
 Millan, DSBallard, SAChunn, SDybowski, JAFulton, CKGlossop, PAGuillabert, EHewson, CAJones, RMLamb, DJNapier, CMPayne-Cook, TARenery, ERSelby, MDTutt, MFYeadon, M Design and synthesis of long acting inhaled corticosteroids for the treatment of asthma. Bioorg Med Chem Lett 21:5826-30 (2011)  
Target
Name:
Glucocorticoid receptor
Synonyms:
GCR_HUMAN GRL Glucocorticoid receptor (GRFP) Nuclear receptor subfamily 3 group C member 1
Type:
Enzyme
Mol. Mass.:
85656.87
Organism:
Homo sapiens (Human)
Description:
P04150
Residue:
777
  
Inhibitor
Name:
BDBM50354851
Synonyms:
FLUTICASONE FUROATE | Veramyst
Type:
Small organic molecule
Emp. Form.:
C27H29F3O6S
Mol. Mass.:
538.576
SMILES:
C[C@@H]1C[C@H]2[C@@H]3C[C@H](F)C4=CC(=O)C=C[C@]4(C)[C@@]3(F)[C@@H](O)C[C@]2(C)[C@@]1(OC(=O)c1ccco1)C(=O)SCF
: