Target
Bile acid receptor
Ligand
BDBM50355025
Substrate
Meas. Tech.
ChEMBL_772465 (CHEMBL1839256)
EC50
490±n/a nM
Citation
 Akwabi-Ameyaw, ACaravella, JAChen, LCreech, KLDeaton, DNMadauss, KPMarr, HBMiller, ABNavas, FParks, DJSpearing, PKTodd, DWilliams, SPWisely, GB Conformationally constrained farnesoid X receptor (FXR) agonists: alternative replacements of the stilbene. Bioorg Med Chem Lett 21:6154-60 (2011)  
Target
Name:
Bile acid receptor
Synonyms:
BAR FXR HRR1 NR1H4_HUMAN RIP14 Retinoid X receptor-interacting protein 14 | farnesoid x receptor
Type:
Nuclear Receptor
Mol. Mass.:
55916.24
Organism:
Homo sapiens (Human)
Description:
Q96RI1
Residue:
486
  
Inhibitor
Name:
BDBM50355025
Synonyms:
CHEMBL1835051
Type:
Small organic molecule
Emp. Form.:
C29H25Cl2NO4
Mol. Mass.:
522.419
SMILES:
CC(C)c1onc(c1COc1ccc(cc1)-c1ccc2CC(Cc2c1)C(O)=O)-c1c(Cl)cccc1Cl
: