Target
Adenosine receptor A3
Ligand
BDBM50355170
Substrate
Meas. Tech.
ChEMBL_772802 (CHEMBL1837541)
Ki
0.16±n/a nM
Citation
 Cheong, SLDolzhenko, AVPaoletta, SLee, EPKachler, SFederico, SKlotz, KNDolzhenko, AVSpalluto, GMoro, SPastorin, G Does the combination of optimal substitutions at the C²-, N¿?¿- and N¿?¿-positions of the pyrazolo-triazolo-pyrimidine scaffold guarantee selective modulation of the human A3 adenosine receptors? Bioorg Med Chem 19:6120-34 (2011)  
Target
Name:
Adenosine receptor A3
Synonyms:
A3 adenosine receptor (hA3) ADORA3 | Adenosine A3 receptor (A3AR)
Type:
G Protein-Coupled Receptor (GPCR)
Mol. Mass.:
36197.32
Organism:
Homo sapiens (Human)
Description:
P0DMS8
Residue:
318
  
Inhibitor
Name:
BDBM50355170
Synonyms:
CHEMBL1834703
Type:
Small organic molecule
Emp. Form.:
C24H18N8O2
Mol. Mass.:
450.4521
SMILES:
Cn1cc2c(n1)nc(NC(=O)Nc1ccccc1)n1nc(nc21)-c1ccc(cc1)-c1ccco1
: