Target
Amine oxidase [flavin-containing] B
Ligand
BDBM50355320
Substrate
Meas. Tech.
ChEMBL_772926 (CHEMBL1838814)
IC50
1.52±n/a nM
Citation
 Matos, MJTerán, CPérez-Castillo, YUriarte, ESantana, LViña, D Synthesis and study of a series of 3-arylcoumarins as potent and selective monoamine oxidase B inhibitors. J Med Chem 54:7127-37 (2011)  
Target
Name:
Amine oxidase [flavin-containing] B
Synonyms:
AOFB_HUMAN MAOB Monoamine oxidase type B (MAO B) Monoamine oxidase type B (MAOB)
Type:
Protein
Mol. Mass.:
58768.76
Organism:
Homo sapiens (Human)
Description:
P27338
Residue:
520
  
Inhibitor
Name:
BDBM50355320
Synonyms:
CHEMBL1835224
Type:
Small organic molecule
Emp. Form.:
C17H14O3
Mol. Mass.:
266.2913
SMILES:
COc1ccc2oc(=O)c(cc2c1)-c1ccc(C)cc1
: