Target
Interleukin-1 receptor-associated kinase 4
Ligand
BDBM50355468
Substrate
Meas. Tech.
ChEMBL_773460 (CHEMBL1840412)
Ki
440±n/a nM
Citation
 Davies, RJPierce, ACForster, CGrey, RXu, JArnost, MChoquette, DGalullo, VTian, SKHenkel, GChen, GHeidary, DKMa, JStuver-Moody, CNamchuk, M Design, synthesis, and evaluation of a novel dual FMS-like tyrosine kinase 3/stem cell factor receptor (FLT3/c-KIT) inhibitor for the treatment of acute myelogenous leukemia. J Med Chem 54:7184-92 (2011)  
Target
Name:
Interleukin-1 receptor-associated kinase 4
Synonyms:
IRAK-4 IRAK4_HUMAN Interleukin-1 receptor-associated kinase 4 (IRAK4) | Renal carcinoma antigen NY-REN-64
Type:
Protein
Mol. Mass.:
51519.08
Organism:
Homo sapiens (Human)
Description:
Q9NWZ3
Residue:
460
  
Inhibitor
Name:
BDBM50355468
Synonyms:
CHEMBL1835743
Type:
Small organic molecule
Emp. Form.:
C17H18FN7O
Mol. Mass.:
355.3695
SMILES:
Nc1nc(Nc2cc(ccc2F)N2CCOCC2)nn1-c1ccccn1
: