Target
Ephrin type-A receptor 6
Ligand
BDBM25617
Substrate
Meas. Tech.
ChEMBL_774228 (CHEMBL1908445)
Kd
>10000±n/a nM
Citation
 Davis, MIHunt, JPHerrgard, SCiceri, PWodicka, LMPallares, GHocker, MTreiber, DKZarrinkar, PP Comprehensive analysis of kinase inhibitor selectivity. Nat Biotechnol 29:1046-51 (2011)  
Target
Name:
Ephrin type-A receptor 6
Synonyms:
EHK-2 EHK2 EPH homology kinase 2 EPHA6 Ephrin receptor HEK12
Type:
PROTEIN
Mol. Mass.:
116385.76
Organism:
Homo sapiens (Human)
Description:
ChEMBL_774228
Residue:
1036
  
Inhibitor
Name:
BDBM25617
Synonyms:
N-[3-({5-chloro-1H-pyrrolo[2,3-b]pyridin-3-yl}carbonyl)-2,4-difluorophenyl]propane-1-sulfonamide | PLX4720
Type:
Small organic molecule
Emp. Form.:
C17H14ClF2N3O3S
Mol. Mass.:
413.826
SMILES:
CCCS(=O)(=O)Nc1ccc(F)c(C(=O)c2c[nH]c3ncc(Cl)cc23)c1F
: