Target
Interleukin-1 receptor-associated kinase 3
Ligand
BDBM60665
Substrate
Meas. Tech.
ChEMBL_774546 (CHEMBL1908763)
Kd
11±n/a nM
Citation
 Davis, MIHunt, JPHerrgard, SCiceri, PWodicka, LMPallares, GHocker, MTreiber, DKZarrinkar, PP Comprehensive analysis of kinase inhibitor selectivity. Nat Biotechnol 29:1046-51 (2011)  
Target
Name:
Interleukin-1 receptor-associated kinase 3
Synonyms:
IL-1 receptor-associated kinase M IRAK-M IRAK3_HUMAN
Type:
PROTEIN
Mol. Mass.:
67767.98
Organism:
Homo sapiens (Human)
Description:
EBI_101055
Residue:
596
  
Inhibitor
Name:
BDBM60665
Synonyms:
BDBM50249542 US9212178, R406
Type:
Emp. Form.:
C22H23FN6O5
Mol. Mass.:
470.4536
SMILES:
COc1cc(Nc2ncc(F)c(Nc3ccc4OC(C)(C)C(=O)Nc4n3)n2)cc(OC)c1OC
: