Target
MAP/microtubule affinity-regulating kinase 3
Ligand
BDBM482158
Substrate
Meas. Tech.
ChEMBL_774343 (CHEMBL1908560)
Kd
12±n/a nM
Citation
 Davis, MIHunt, JPHerrgard, SCiceri, PWodicka, LMPallares, GHocker, MTreiber, DKZarrinkar, PP Comprehensive analysis of kinase inhibitor selectivity. Nat Biotechnol 29:1046-51 (2011)  
Target
Name:
MAP/microtubule affinity-regulating kinase 3
Synonyms:
2.7.11.1 CTAK1 ELKL motif kinase 2 EMK2 MAP/microtubule affinity-regulating kinase 3 (MARK 3) MARK3_HUMAN Protein kinase STK10 Serine/threonine-protein kinase c-TAK1 | Serine/threonine-protein kinase p78
Type:
Protein
Mol. Mass.:
84525.94
Organism:
Homo sapiens (Human)
Description:
P27448
Residue:
753
  
Inhibitor
Name:
BDBM482158
Synonyms:
BDBM50242742 | TAE684
Type:
Emp. Form.:
C30H40ClN7O3S
Mol. Mass.:
614.202
SMILES:
COc1cc(ccc1Nc1ncc(Cl)c(Nc2ccccc2S(=O)(=O)C(C)C)n1)N1CCC(CC1)N1CCN(C)CC1
: