Target
Protein kinase C eta type
Ligand
BDBM50355494
Substrate
Meas. Tech.
ChEMBL_774529 (CHEMBL1908746)
Kd
>10000±n/a nM
Citation
 Davis, MIHunt, JPHerrgard, SCiceri, PWodicka, LMPallares, GHocker, MTreiber, DKZarrinkar, PP Comprehensive analysis of kinase inhibitor selectivity. Nat Biotechnol 29:1046-51 (2011)  
Target
Name:
Protein kinase C eta type
Synonyms:
KPCL_HUMAN PKCL PRKCL Protein kinase C, PKC; classical/novel | nPKC-eta
Type:
Enzyme
Mol. Mass.:
77844.26
Organism:
Homo sapiens (Human)
Description:
The recombinant human PKC enzymes were produced using a baculovirus expression system in SF9 cells
Residue:
683
  
Inhibitor
Name:
BDBM50355494
Synonyms:
CHEMBL1908396
Type:
Small organic molecule
Emp. Form.:
C24H24N4O5S
Mol. Mass.:
480.536
SMILES:
COc1cc(Oc2ccnc3cc(OC)c(OC)cc23)ccc1NC(=O)NC(C)c1nccs1
: