Target
Calcium/calmodulin-dependent protein kinase kinase 2
Ligand
BDBM25117
Substrate
Meas. Tech.
ChEMBL_774540 (CHEMBL1908757)
Kd
1500±n/a nM
Citation
 Davis, MIHunt, JPHerrgard, SCiceri, PWodicka, LMPallares, GHocker, MTreiber, DKZarrinkar, PP Comprehensive analysis of kinase inhibitor selectivity. Nat Biotechnol 29:1046-51 (2011)  
Target
Name:
Calcium/calmodulin-dependent protein kinase kinase 2
Synonyms:
CAMKK2 Calcium/calmodulin-dependent protein kinase kinase 2 (CaMKKB) KIAA0787 | KKCC2_HUMAN
Type:
Enzyme Catalytic Domain
Mol. Mass.:
64746.61
Organism:
Homo sapiens (Human)
Description:
gi_27437015
Residue:
588
  
Inhibitor
Name:
BDBM25117
Synonyms:
AG-013736 N-methyl-2-({3-[(E)-2-(pyridin-2-yl)ethenyl]-1H-indazol-6-yl}sulfanyl)benzamide US9205078, Axitinib | US9617222, Compound A
Type:
Small organic molecule
Emp. Form.:
C22H18N4OS
Mol. Mass.:
386.47
SMILES:
CNC(=O)c1ccccc1Sc1ccc2c(\C=C\c3ccccn3)n[nH]c2c1
: