Target
Dual specificity mitogen-activated protein kinase kinase 6
Ligand
BDBM50026612
Substrate
Meas. Tech.
ChEMBL_774375 (CHEMBL1908592)
Kd
>10000±n/a nM
Citation
 Davis, MIHunt, JPHerrgard, SCiceri, PWodicka, LMPallares, GHocker, MTreiber, DKZarrinkar, PP Comprehensive analysis of kinase inhibitor selectivity. Nat Biotechnol 29:1046-51 (2011)  
Target
Name:
Dual specificity mitogen-activated protein kinase kinase 6
Synonyms:
Dual specificity mitogen-activated protein kinase kinase 6 MAP2K6 MAPKK 6 MKK6 Mitogen-activated protein kinase kinase 6 (MKK6) SAPKK3 | SKK3
Type:
Protein
Mol. Mass.:
37494.96
Organism:
Homo sapiens (Human)
Description:
P52564
Residue:
334
  
Inhibitor
Name:
BDBM50026612
Synonyms:
BIBF-1120 US10981896, Compound Nintedanib US11208381, Nintedanib | Vargatef
Type:
Small organic molecule
Emp. Form.:
C31H33N5O4
Mol. Mass.:
539.6248
SMILES:
COC(=O)c1ccc2\C(=C(\Nc3ccc(cc3)N(C)C(=O)CN3CCN(C)CC3)c3ccccc3)C(=O)Nc2c1
: