Target
Phosphatidylinositol 4-phosphate 5-kinase type-1 alpha
Ligand
BDBM24773
Substrate
Meas. Tech.
ChEMBL_774304 (CHEMBL1908521)
Kd
>10000±n/a nM
Citation
 Davis, MIHunt, JPHerrgard, SCiceri, PWodicka, LMPallares, GHocker, MTreiber, DKZarrinkar, PP Comprehensive analysis of kinase inhibitor selectivity. Nat Biotechnol 29:1046-51 (2011)  
Target
Name:
Phosphatidylinositol 4-phosphate 5-kinase type-1 alpha
Synonyms:
PI51A_HUMAN Phosphatidylinositol-4-phosphate 5-kinase type-1 alpha
Type:
PROTEIN
Mol. Mass.:
62644.19
Organism:
Homo sapiens (Human)
Description:
ChEMBL_774304
Residue:
562
  
Inhibitor
Name:
BDBM24773
Synonyms:
AMG 706 Motesanib N-(3,3-dimethyl-1,2-dihydroindol-6-yl)-2-(pyridin-4-ylmethylamino)pyridine-3-carboxamide N-(3,3-dimethylindolin-6-yl)-2-(4-pyridylmethylamino)nicotinamide cid_11667893
Type:
Small organic molecule
Emp. Form.:
C22H23N5O
Mol. Mass.:
373.4509
SMILES:
CC1(C)CNc2cc(NC(=O)c3cccnc3NCc3ccncc3)ccc12
: