Target
Phosphatidylinositol 5-phosphate 4-kinase type-2 gamma
Ligand
BDBM60589
Substrate
Meas. Tech.
ChEMBL_774614 (CHEMBL1908831)
Kd
3300±n/a nM
Citation
 Davis, MIHunt, JPHerrgard, SCiceri, PWodicka, LMPallares, GHocker, MTreiber, DKZarrinkar, PP Comprehensive analysis of kinase inhibitor selectivity. Nat Biotechnol 29:1046-51 (2011)  
Target
Name:
Phosphatidylinositol 5-phosphate 4-kinase type-2 gamma
Synonyms:
PI(5)P 4-kinase type II gamma PIP4K2C PIP5K2C Phosphatidylinositol-5-phosphate 4-kinase type-2 gamma
Type:
PROTEIN
Mol. Mass.:
47302.35
Organism:
Homo sapiens (Human)
Description:
ChEMBL_774614
Residue:
421
  
Inhibitor
Name:
BDBM60589
Synonyms:
6-{[6-(1-methyl-1H-pyrazol-4-yl)-[1,2,4]triazolo[4,3-b]pyridazin-3-yl]sulfanyl}quinoline (4) | BDBM50355498
Type:
Emp. Form.:
C18H13N7S
Mol. Mass.:
359.408
SMILES:
Cn1cc(cn1)-c1ccc2nnc(Sc3ccc4ncccc4c3)n2n1
: