Target
Phosphatidylinositol 3-kinase C2 domain-containing subunit gamma
Ligand
BDBM21
Substrate
Meas. Tech.
ChEMBL_774438 (CHEMBL1908655)
Kd
>10000±n/a nM
Citation
 Davis, MIHunt, JPHerrgard, SCiceri, PWodicka, LMPallares, GHocker, MTreiber, DKZarrinkar, PP Comprehensive analysis of kinase inhibitor selectivity. Nat Biotechnol 29:1046-51 (2011)  
Target
Name:
Phosphatidylinositol 3-kinase C2 domain-containing subunit gamma
Synonyms:
P3C2G_HUMAN PIK3C2G Phosphoinositide 3-kinase-C2-gamma | PtdIns-3-kinase C2 subunit gamma
Type:
PROTEIN
Mol. Mass.:
165726.35
Organism:
Homo sapiens (Human)
Description:
ChEMBL_1447686
Residue:
1445
  
Inhibitor
Name:
BDBM21
Synonyms:
CHEMBL24828 VANDETANIB ZD6474 | cid_3081361
Type:
Emp. Form.:
C22H24BrFN4O2
Mol. Mass.:
475.354
SMILES:
COc1cc2c(Nc3ccc(Br)cc3F)ncnc2cc1OCC1CCN(C)CC1
: