Target
Cyclin-dependent kinase 11B
Ligand
BDBM16673
Substrate
Meas. Tech.
ChEMBL_774188 (CHEMBL1908405)
Kd
>10000±n/a nM
Citation
 Davis, MIHunt, JPHerrgard, SCiceri, PWodicka, LMPallares, GHocker, MTreiber, DKZarrinkar, PP Comprehensive analysis of kinase inhibitor selectivity. Nat Biotechnol 29:1046-51 (2011)  
Target
Name:
Cyclin-dependent kinase 11B
Synonyms:
2.7.11.22 CDC2L1 CDK11B Cell division cycle 2-like protein kinase 1 Cyclin-dependent kinase Cyclin-dependent kinase 11B PITSLRE serine/threonine-protein kinase CDC2L1 PK58 | p58 CLK-1
Type:
Protein
Mol. Mass.:
92685.77
Organism:
Homo sapiens (Human)
Description:
P21127
Residue:
795
  
Inhibitor
Name:
BDBM16673
Synonyms:
4-[4-({[4-chloro-3-(trifluoromethyl)phenyl]carbamoyl}amino)phenoxy]-N-methylpyridine-2-carboxamide BAY 43-9006 BAY439006 Hit compound, 8 Sorafenib US10183928, Sorafenib US10227329, Compound Sorafenib US10774070, Compound Sorafenib US11279688, Compound Sorafenib US9029401, Sorafenib US9902709, Comparative example 1 cid_216239
Type:
Small organic molecule
Emp. Form.:
C21H16ClF3N4O3
Mol. Mass.:
464.825
SMILES:
CNC(=O)c1cc(Oc2ccc(NC(=O)Nc3ccc(Cl)c(c3)C(F)(F)F)cc2)ccn1
: