Target
Mitogen-activated protein kinase kinase kinase 12
Ligand
BDBM26300
Substrate
Meas. Tech.
ChEMBL_774242 (CHEMBL1908459)
Kd
>10000±n/a nM
Citation
 Davis, MIHunt, JPHerrgard, SCiceri, PWodicka, LMPallares, GHocker, MTreiber, DKZarrinkar, PP Comprehensive analysis of kinase inhibitor selectivity. Nat Biotechnol 29:1046-51 (2011)  
Target
Name:
Mitogen-activated protein kinase kinase kinase 12
Synonyms:
DLK Leucine-zipper protein kinase MAP3K12 MUK Mixed lineage kinase | ZPK
Type:
PROTEIN
Mol. Mass.:
93216.56
Organism:
Homo sapiens (Human)
Description:
ChEMBL_1460553
Residue:
859
  
Inhibitor
Name:
BDBM26300
Synonyms:
2-{3-[(7-{3-[ethyl(2-hydroxyethyl)amino]propoxy}quinazolin-4-yl)amino]-1H-pyrazol-5-yl}-N-(3-fluorophenyl)acetamide cid_16007391 | pyrazoloquinazoline deriv., 34
Type:
Small organic molecule
Emp. Form.:
C26H30FN7O3
Mol. Mass.:
507.5599
SMILES:
CCN(CCO)CCCOc1ccc2c(Nc3cc(CC(=O)Nc4cccc(F)c4)n[nH]3)ncnc2c1
: