Target
Serine/threonine-protein kinase SIK3 [59-1321]
Ligand
BDBM4552
Substrate
Meas. Tech.
ChEMBL_774254 (CHEMBL1908471)
Kd
64±n/a nM
Citation
 Davis, MIHunt, JPHerrgard, SCiceri, PWodicka, LMPallares, GHocker, MTreiber, DKZarrinkar, PP Comprehensive analysis of kinase inhibitor selectivity. Nat Biotechnol 29:1046-51 (2011)  
Target
Name:
Serine/threonine-protein kinase SIK3 [59-1321]
Synonyms:
KIAA0999 QSK SIK3 Salt-inducible kinase 3 Serine/threonine-protein kinase SIK3
Type:
PROTEIN
Mol. Mass.:
139984.87
Organism:
Homo sapiens (Human)
Description:
ChEMBL_774254
Residue:
1263
  
Inhibitor
Name:
BDBM4552
Synonyms:
4-[(2,4-Dichloro-5-methoxyphenyl)amino]-6-methoxy-7-[3-(4-methyl-1-piperazinyl)propoxy]-3-quinolinecarbonitrile BOSUTINIB SKI-606
Type:
Small organic molecule
Emp. Form.:
C26H29Cl2N5O3
Mol. Mass.:
530.446
SMILES:
COc1cc(Nc2c(cnc3cc(OCCCN4CCN(C)CC4)c(OC)cc23)C#N)c(Cl)cc1Cl
: