Target
Serine/threonine-protein kinase VRK2
Ligand
BDBM50300690
Substrate
Meas. Tech.
ChEMBL_774538 (CHEMBL1908755)
Kd
>10000±n/a nM
Citation
 Davis, MIHunt, JPHerrgard, SCiceri, PWodicka, LMPallares, GHocker, MTreiber, DKZarrinkar, PP Comprehensive analysis of kinase inhibitor selectivity. Nat Biotechnol 29:1046-51 (2011)  
Target
Name:
Serine/threonine-protein kinase VRK2
Synonyms:
VRK2 Vaccinia-related kinase 2
Type:
PROTEIN
Mol. Mass.:
58156.94
Organism:
Homo sapiens (Human)
Description:
ChEMBL_774538
Residue:
508
  
Inhibitor
Name:
BDBM50300690
Synonyms:
1-(5-Tert-Butyl-1,2-Oxazol-3-Yl)-3-(4-{7-[2-(Morpholin-4-Yl)ethoxy]imidazo[2,1-B][1,3]benzothiazol-2-Yl}phenyl)urea AC 220 AC010220 ASP-2689 N-(5-tert-Butyl-isoxazol-3-yl)-N'-{4-[7-(2-morpholin-4-yl-ethoxy)imidazo[2,1-b][1,3]benzothiazol-2-yl]phenyl}urea Quizartinib (AC220) US11542261, Compound quizartinib | US9216997, Quizartinib (positive compound)
Type:
Small organic molecule
Emp. Form.:
C29H32N6O4S
Mol. Mass.:
560.667
SMILES:
CC(C)(C)c1cc(NC(=O)Nc2ccc(cc2)-c2cn3c(n2)sc2cc(OCCN4CCOCC4)ccc32)no1
: