Target
Dual serine/threonine and tyrosine protein kinase
Ligand
BDBM5655
Substrate
Meas. Tech.
ChEMBL_774238 (CHEMBL1908455)
Kd
4200±n/a nM
Citation
 Davis, MIHunt, JPHerrgard, SCiceri, PWodicka, LMPallares, GHocker, MTreiber, DKZarrinkar, PP Comprehensive analysis of kinase inhibitor selectivity. Nat Biotechnol 29:1046-51 (2011)  
Target
Name:
Dual serine/threonine and tyrosine protein kinase
Synonyms:
DSTYK Dusty PK KIAA0472 RIP5 Receptor-interacting serine/threonine-protein kinase 5 Sugen kinase 496
Type:
PROTEIN
Mol. Mass.:
105208.50
Organism:
Homo sapiens (Human)
Description:
ChEMBL_774238
Residue:
929
  
Inhibitor
Name:
BDBM5655
Synonyms:
2-(2-chlorophenyl)-5,7-dihydroxy-8-[(3S,4R)-3-hydroxy-1-methylpiperidin-4-yl]-4H-chromen-4-one Flavopiridol US9617225, Flavopiridol
Type:
Small organic molecule
Emp. Form.:
C21H20ClNO5
Mol. Mass.:
401.84
SMILES:
CN1CC[C@@H]([C@H](O)C1)c1c(O)cc(O)c2c1oc(cc2=O)-c1ccccc1Cl
: