Target
Cyclin-dependent kinase-like 2
Ligand
BDBM25028
Substrate
Meas. Tech.
ChEMBL_774408 (CHEMBL1908625)
Kd
>10000±n/a nM
Citation
 Davis, MIHunt, JPHerrgard, SCiceri, PWodicka, LMPallares, GHocker, MTreiber, DKZarrinkar, PP Comprehensive analysis of kinase inhibitor selectivity. Nat Biotechnol 29:1046-51 (2011)  
Target
Name:
Cyclin-dependent kinase-like 2
Synonyms:
2.7.11.22 CDKL2_HUMAN Serine/threonine-protein kinase KKIAMRE
Type:
Mol. Mass.:
56031.51
Organism:
Homo sapiens (Human)
Description:
Q92772
Residue:
493
  
Inhibitor
Name:
BDBM25028
Synonyms:
4-[2-(1H-indazol-4-yl)-6-[(4-methanesulfonylpiperazin-1-yl)methyl]thieno[3,2-d]pyrimidin-4-yl]morpholine GDC0941 US10851091, Compound pictilisib
Type:
Small organic molecule
Emp. Form.:
C23H27N7O3S2
Mol. Mass.:
513.636
SMILES:
CS(=O)(=O)N1CCN(Cc2cc3nc(nc(N4CCOCC4)c3s2)-c2cccc3[nH]ncc23)CC1
: