Target
Phosphatidylinositol 3-kinase C2 domain-containing subunit gamma
Ligand
BDBM50242737
Substrate
Meas. Tech.
ChEMBL_774438 (CHEMBL1908655)
Kd
>10000±n/a nM
Citation
 Davis, MIHunt, JPHerrgard, SCiceri, PWodicka, LMPallares, GHocker, MTreiber, DKZarrinkar, PP Comprehensive analysis of kinase inhibitor selectivity. Nat Biotechnol 29:1046-51 (2011)  
Target
Name:
Phosphatidylinositol 3-kinase C2 domain-containing subunit gamma
Synonyms:
P3C2G_HUMAN PIK3C2G Phosphoinositide 3-kinase-C2-gamma | PtdIns-3-kinase C2 subunit gamma
Type:
PROTEIN
Mol. Mass.:
165726.35
Organism:
Homo sapiens (Human)
Description:
ChEMBL_1447686
Residue:
1445
  
Inhibitor
Name:
BDBM50242737
Synonyms:
(R,Z)-5-(2,6-dichlorobenzylsulfonyl)-3-((3,5-dimethyl-4-(2-(pyrrolidin-1-ylmethyl)pyrrolidine-1-carbonyl)-1H-pyrrol-2-yl)methylene)indolin-2-one PHA-665752 | TCMDC-125885
Type:
Small organic molecule
Emp. Form.:
C32H34Cl2N4O4S
Mol. Mass.:
641.608
SMILES:
Cc1[nH]c(\C=C2/C(=O)Nc3ccc(cc23)S(=O)(=O)Cc2c(Cl)cccc2Cl)c(C)c1C(=O)N1CCC[C@@H]1CN1CCCC1
: