Target
Calcium/calmodulin-dependent protein kinase kinase 1
Ligand
BDBM25118
Substrate
Meas. Tech.
ChEMBL_774623 (CHEMBL1908840)
Kd
3100±n/a nM
Citation
 Davis, MIHunt, JPHerrgard, SCiceri, PWodicka, LMPallares, GHocker, MTreiber, DKZarrinkar, PP Comprehensive analysis of kinase inhibitor selectivity. Nat Biotechnol 29:1046-51 (2011)  
Target
Name:
Calcium/calmodulin-dependent protein kinase kinase 1
Synonyms:
CAMKK1 CaM-kinase kinase alpha | KKCC1_HUMAN
Type:
PROTEIN
Mol. Mass.:
55727.76
Organism:
Homo sapiens (Human)
Description:
ChEMBL_774623
Residue:
505
  
Inhibitor
Name:
BDBM25118
Synonyms:
(3Z)-4-amino-5-fluoro-3-[5-(4-methylpiperazino)-1,3-dihydrobenzimidazol-2-ylidene]carbostyril CHEMBL522892 | CHIR-258
Type:
Small organic molecule
Emp. Form.:
C21H21FN6O
Mol. Mass.:
392.4294
SMILES:
CN1CCN(CC1)c1ccc2nc([nH]c2c1)-c1c(N)c2c(F)cccc2[nH]c1=O
: