Target
Calcium/calmodulin-dependent protein kinase type II subunit delta
Ligand
BDBM60589
Substrate
Meas. Tech.
ChEMBL_774250 (CHEMBL1908467)
Kd
>10000±n/a nM
Citation
 Davis, MIHunt, JPHerrgard, SCiceri, PWodicka, LMPallares, GHocker, MTreiber, DKZarrinkar, PP Comprehensive analysis of kinase inhibitor selectivity. Nat Biotechnol 29:1046-51 (2011)  
Target
Name:
Calcium/calmodulin-dependent protein kinase type II subunit delta
Synonyms:
CAMK2D CaM kinase II CaMK-II subunit delta Calcium/calmodulin-dependent protein kinase type II subunit delta (CAMK2D) KCC2D_HUMAN
Type:
Enzyme Catalytic Domain
Mol. Mass.:
56419.78
Organism:
Homo sapiens (Human)
Description:
Q13557
Residue:
499
  
Inhibitor
Name:
BDBM60589
Synonyms:
6-{[6-(1-methyl-1H-pyrazol-4-yl)-[1,2,4]triazolo[4,3-b]pyridazin-3-yl]sulfanyl}quinoline (4) | BDBM50355498
Type:
Emp. Form.:
C18H13N7S
Mol. Mass.:
359.408
SMILES:
Cn1cc(cn1)-c1ccc2nnc(Sc3ccc4ncccc4c3)n2n1
: