Target
Cyclin-dependent kinase 11B
Ligand
BDBM4552
Substrate
Meas. Tech.
ChEMBL_774188 (CHEMBL1908405)
Kd
>10000±n/a nM
Citation
 Davis, MIHunt, JPHerrgard, SCiceri, PWodicka, LMPallares, GHocker, MTreiber, DKZarrinkar, PP Comprehensive analysis of kinase inhibitor selectivity. Nat Biotechnol 29:1046-51 (2011)  
Target
Name:
Cyclin-dependent kinase 11B
Synonyms:
2.7.11.22 CDC2L1 CDK11B Cell division cycle 2-like protein kinase 1 Cyclin-dependent kinase Cyclin-dependent kinase 11B PITSLRE serine/threonine-protein kinase CDC2L1 PK58 | p58 CLK-1
Type:
Protein
Mol. Mass.:
92685.77
Organism:
Homo sapiens (Human)
Description:
P21127
Residue:
795
  
Inhibitor
Name:
BDBM4552
Synonyms:
4-[(2,4-Dichloro-5-methoxyphenyl)amino]-6-methoxy-7-[3-(4-methyl-1-piperazinyl)propoxy]-3-quinolinecarbonitrile BOSUTINIB SKI-606
Type:
Small organic molecule
Emp. Form.:
C26H29Cl2N5O3
Mol. Mass.:
530.446
SMILES:
COc1cc(Nc2c(cnc3cc(OCCCN4CCN(C)CC4)c(OC)cc23)C#N)c(Cl)cc1Cl
: