Target
Ephrin type-A receptor 5
Ligand
BDBM24654
Substrate
Meas. Tech.
ChEMBL_774217 (CHEMBL1908434)
Kd
>10000±n/a nM
Citation
 Davis, MIHunt, JPHerrgard, SCiceri, PWodicka, LMPallares, GHocker, MTreiber, DKZarrinkar, PP Comprehensive analysis of kinase inhibitor selectivity. Nat Biotechnol 29:1046-51 (2011)  
Target
Name:
Ephrin type-A receptor 5
Synonyms:
BSK EPHA5 Ephrin receptor HEK7 | TYRO4
Type:
PROTEIN
Mol. Mass.:
114807.59
Organism:
Homo sapiens (Human)
Description:
ChEMBL_774217
Residue:
1037
  
Inhibitor
Name:
BDBM24654
Synonyms:
4-N-(2,6-dichlorobenzene)-3-N-(piperidin-4-yl)-1H-pyrazole-3,4-diamido JMC514986 Compound 33 | pyrazole diamide, 33
Type:
Small organic molecule
Emp. Form.:
C16H17Cl2N5O2
Mol. Mass.:
382.244
SMILES:
Clc1cccc(Cl)c1C(=O)Nc1cn[nH]c1C(=O)NC1CCNCC1
: