Target
Proto-oncogene tyrosine-protein kinase ROS
Ligand
BDBM5445
Substrate
Meas. Tech.
ChEMBL_774379 (CHEMBL1908596)
Kd
>10000±n/a nM
Citation
 Davis, MIHunt, JPHerrgard, SCiceri, PWodicka, LMPallares, GHocker, MTreiber, DKZarrinkar, PP Comprehensive analysis of kinase inhibitor selectivity. Nat Biotechnol 29:1046-51 (2011)  
Target
Name:
Proto-oncogene tyrosine-protein kinase ROS
Synonyms:
MCF3 Proto-oncogene c-Ros-1 ROS1 Receptor tyrosine kinase c-ros oncogene 1 c-Ros receptor tyrosine kinase
Type:
Enzyme
Mol. Mass.:
263897.39
Organism:
Homo sapiens (Human)
Description:
P08922
Residue:
2347
  
Inhibitor
Name:
BDBM5445
Synonyms:
CHEMBL554 LAPATINIB DITOSYLATE N-{3-chloro-4-[(3-fluoro-benzyl)oxy]phenyl}-6-[5-({2-(methylsulfonyl)ethyl]amino}methyl)-2-furyl]-4-quinazolinamine Tykerb US10822334, Compound Lapatinib cid_208908
Type:
Small organic molecule
Emp. Form.:
C29H26ClFN4O4S
Mol. Mass.:
581.058
SMILES:
CS(=O)(=O)CCNCc1ccc(o1)-c1ccc2ncnc(Nc3ccc(OCc4cccc(F)c4)c(Cl)c3)c2c1
: