Target
Serine/threonine-protein kinase B-raf
Ligand
BDBM25617
Substrate
Meas. Tech.
ChEMBL_774427 (CHEMBL1908644)
Kd
100±n/a nM
Citation
 Davis, MIHunt, JPHerrgard, SCiceri, PWodicka, LMPallares, GHocker, MTreiber, DKZarrinkar, PP Comprehensive analysis of kinase inhibitor selectivity. Nat Biotechnol 29:1046-51 (2011)  
Target
Name:
Serine/threonine-protein kinase B-raf
Synonyms:
B-RAF B-Raf proto-oncogene serine/threonine-protein kinase BRAF1 RAFB1 v-Raf murine sarcoma viral oncogene homolog B1
Type:
Serine/threonine-protein kinase
Mol. Mass.:
84446.00
Organism:
Homo sapiens (Human)
Description:
P15056
Residue:
766
  
Inhibitor
Name:
BDBM25617
Synonyms:
N-[3-({5-chloro-1H-pyrrolo[2,3-b]pyridin-3-yl}carbonyl)-2,4-difluorophenyl]propane-1-sulfonamide | PLX4720
Type:
Small organic molecule
Emp. Form.:
C17H14ClF2N3O3S
Mol. Mass.:
413.826
SMILES:
CCCS(=O)(=O)Nc1ccc(F)c(C(=O)c2c[nH]c3ncc(Cl)cc23)c1F
: