Target
Serine/threonine-protein kinase ULK3
Ligand
BDBM5931
Substrate
Meas. Tech.
ChEMBL_774298 (CHEMBL1908515)
Kd
>10000±n/a nM
Citation
 Davis, MIHunt, JPHerrgard, SCiceri, PWodicka, LMPallares, GHocker, MTreiber, DKZarrinkar, PP Comprehensive analysis of kinase inhibitor selectivity. Nat Biotechnol 29:1046-51 (2011)  
Target
Name:
Serine/threonine-protein kinase ULK3
Synonyms:
ULK3 | ULK3_HUMAN
Type:
PROTEIN
Mol. Mass.:
53449.41
Organism:
Homo sapiens (Human)
Description:
ChEMBL_774298
Residue:
472
  
Inhibitor
Name:
BDBM5931
Synonyms:
BMS-387072 N-(5-{[(5-tert-butyl-1,3-oxazol-2-yl)methyl]sulfanyl}-1,3-thiazol-2-yl)piperidine-4-carboxamide cid_3025986
Type:
Small organic molecule
Emp. Form.:
C17H24N4O2S2
Mol. Mass.:
380.528
SMILES:
CC(C)(C)c1cnc(CSc2cnc(NC(=O)C3CCNCC3)s2)o1
: