Target
Hormonally up-regulated neu tumor-associated kinase
Ligand
BDBM5447
Substrate
Meas. Tech.
ChEMBL_774564 (CHEMBL1908781)
Kd
>10000±n/a nM
Citation
 Davis, MIHunt, JPHerrgard, SCiceri, PWodicka, LMPallares, GHocker, MTreiber, DKZarrinkar, PP Comprehensive analysis of kinase inhibitor selectivity. Nat Biotechnol 29:1046-51 (2011)  
Target
Name:
Hormonally up-regulated neu tumor-associated kinase
Synonyms:
B19 HUNK_HUMAN Serine/threonine-protein kinase MAK-V
Type:
PROTEIN
Mol. Mass.:
79715.88
Organism:
Homo sapiens (Human)
Description:
ChEMBL_774564
Residue:
714
  
Inhibitor
Name:
BDBM5447
Synonyms:
CHEMBL939 Iressa N-(3-chloro-4-fluorophenyl)-7-methoxy-6-[3-(morpholin-4-yl)propoxy]quinazolin-4-amine US10507209, Compound Gefitinib US9730934, Gefitinib WO2022090481, Example gefitinib cid_123631
Type:
Small organic molecule
Emp. Form.:
C22H24ClFN4O3
Mol. Mass.:
446.902
SMILES:
COc1cc2ncnc(Nc3ccc(F)c(Cl)c3)c2cc1OCCCN1CCOCC1
: