Target
Casein kinase I isoform alpha-like
Ligand
BDBM36409
Substrate
Meas. Tech.
ChEMBL_774203 (CHEMBL1908420)
Kd
2000±n/a nM
Citation
 Davis, MIHunt, JPHerrgard, SCiceri, PWodicka, LMPallares, GHocker, MTreiber, DKZarrinkar, PP Comprehensive analysis of kinase inhibitor selectivity. Nat Biotechnol 29:1046-51 (2011)  
Target
Name:
Casein kinase I isoform alpha-like
Synonyms:
CSNK1A1L KC1AL_HUMAN
Type:
PROTEIN
Mol. Mass.:
39105.63
Organism:
Homo sapiens (Human)
Description:
ChEMBL_586447
Residue:
337
  
Inhibitor
Name:
BDBM36409
Synonyms:
2-(4-amino-1-isopropyl-1H-pyrazolo[3,4-d]pyrimidin-3-yl)-1H-indol-5-ol, PP242 US10172858, Table 2.1 | US9828378, # 1
Type:
Small organic molecule
Emp. Form.:
C16H16N6O
Mol. Mass.:
308.3378
SMILES:
CC(C)n1nc(-c2cc3cc(O)ccc3[nH]2)c2c(N)ncnc12
: