Target
Phosphatidylinositol 4-phosphate 5-kinase type-1 alpha
Ligand
BDBM50161957
Substrate
Meas. Tech.
ChEMBL_774304 (CHEMBL1908521)
Kd
>10000±n/a nM
Citation
 Davis, MIHunt, JPHerrgard, SCiceri, PWodicka, LMPallares, GHocker, MTreiber, DKZarrinkar, PP Comprehensive analysis of kinase inhibitor selectivity. Nat Biotechnol 29:1046-51 (2011)  
Target
Name:
Phosphatidylinositol 4-phosphate 5-kinase type-1 alpha
Synonyms:
PI51A_HUMAN Phosphatidylinositol-4-phosphate 5-kinase type-1 alpha
Type:
PROTEIN
Mol. Mass.:
62644.19
Organism:
Homo sapiens (Human)
Description:
ChEMBL_774304
Residue:
562
  
Inhibitor
Name:
BDBM50161957
Synonyms:
4-Dimethylamino-but-2-enoic acid {4-[3-chloro-4-(pyridin-2-ylmethoxy)-phenylamino]-3-cyano-7-ethoxy-quinolin-6-yl}-amide HKI-272 N-(4-(3-chloro-4-(pyridin-2-ylmethoxy)phenylamino)-3-cyano-7-ethoxyquinolin-6-yl)-4-(dimethylamino)butanamide US10822334, Compound Neratinib | US20230382923, Compound Neratinib
Type:
Small organic molecule
Emp. Form.:
C30H29ClN6O3
Mol. Mass.:
557.043
SMILES:
CCOc1cc2ncc(C#N)c(Nc3ccc(OCc4ccccn4)c(Cl)c3)c2cc1NC(=O)\C=C\CN(C)C
: