Target
Mitogen-activated protein kinase kinase kinase 1
Ligand
BDBM50355504
Substrate
Meas. Tech.
ChEMBL_774506 (CHEMBL1908723)
Kd
>10000±n/a nM
Citation
 Davis, MIHunt, JPHerrgard, SCiceri, PWodicka, LMPallares, GHocker, MTreiber, DKZarrinkar, PP Comprehensive analysis of kinase inhibitor selectivity. Nat Biotechnol 29:1046-51 (2011)  
Target
Name:
Mitogen-activated protein kinase kinase kinase 1
Synonyms:
M3K1_HUMAN MAPK/ERK kinase kinase 1 MEK Kinase 1 (MEKK1) MEKK1
Type:
Serine/threonine-protein kinase
Mol. Mass.:
164491.32
Organism:
Homo sapiens (Human)
Description:
Residue:
1512
  
Inhibitor
Name:
BDBM50355504
Synonyms:
CHEMBL1908393
Type:
Small organic molecule
Emp. Form.:
C34H36F2N4O6
Mol. Mass.:
634.6696
SMILES:
COc1cc2c(Oc3ccc(NC(=O)C4(CC4)C(=O)NC4=CCC(F)C=C4)cc3F)ccnc2cc1OCCCN1CCOCC1
: