Target
Phosphatidylinositol 5-phosphate 4-kinase type-2 gamma
Ligand
BDBM5447
Substrate
Meas. Tech.
ChEMBL_774614 (CHEMBL1908831)
Kd
7500±n/a nM
Citation
 Davis, MIHunt, JPHerrgard, SCiceri, PWodicka, LMPallares, GHocker, MTreiber, DKZarrinkar, PP Comprehensive analysis of kinase inhibitor selectivity. Nat Biotechnol 29:1046-51 (2011)  
Target
Name:
Phosphatidylinositol 5-phosphate 4-kinase type-2 gamma
Synonyms:
PI(5)P 4-kinase type II gamma PIP4K2C PIP5K2C Phosphatidylinositol-5-phosphate 4-kinase type-2 gamma
Type:
PROTEIN
Mol. Mass.:
47302.35
Organism:
Homo sapiens (Human)
Description:
ChEMBL_774614
Residue:
421
  
Inhibitor
Name:
BDBM5447
Synonyms:
CHEMBL939 Iressa N-(3-chloro-4-fluorophenyl)-7-methoxy-6-[3-(morpholin-4-yl)propoxy]quinazolin-4-amine US10507209, Compound Gefitinib US9730934, Gefitinib WO2022090481, Example gefitinib cid_123631
Type:
Small organic molecule
Emp. Form.:
C22H24ClFN4O3
Mol. Mass.:
446.902
SMILES:
COc1cc2ncnc(Nc3ccc(F)c(Cl)c3)c2cc1OCCCN1CCOCC1
: