Target
MAP kinase-activated protein kinase 5
Ligand
BDBM13535
Substrate
Meas. Tech.
ChEMBL_774403 (CHEMBL1908620)
Kd
>10000±n/a nM
Citation
 Davis, MIHunt, JPHerrgard, SCiceri, PWodicka, LMPallares, GHocker, MTreiber, DKZarrinkar, PP Comprehensive analysis of kinase inhibitor selectivity. Nat Biotechnol 29:1046-51 (2011)  
Target
Name:
MAP kinase-activated protein kinase 5
Synonyms:
MAP kinase-activated protein kinase 5 (PRAK) MAPK-activated protein kinase 5 MAPKAP kinase 5 PRAK p38-regulated/activated protein kinase (PRAK)
Type:
Serine/threonine-protein kinase
Mol. Mass.:
54229.92
Organism:
Homo sapiens (Human)
Description:
Recombinant MAPKAPK5 was phosphorylated by incubation with active p38alpha before assays.
Residue:
473
  
Inhibitor
Name:
BDBM13535
Synonyms:
4-[6-methoxy-7-(3-piperidin-1-ylpropoxy)quinazolin-4-yl]-N-(4-propan-2-yloxyphenyl)piperazine-1-carboxamide 4-[6-methoxy-7-[3-(1-piperidinyl)propoxy]-4-quinazolinyl]-N-(4-propan-2-yloxyphenyl)-1-piperazinecarboxamide CHEMBL124660 MLN518 cid_3038522
Type:
Small organic molecule
Emp. Form.:
C31H42N6O4
Mol. Mass.:
562.703
SMILES:
COc1cc2c(ncnc2cc1OCCCN1CCCCC1)N1CCN(CC1)C(=O)Nc1ccc(OC(C)C)cc1
: