Target
Casein kinase I isoform alpha
Ligand
BDBM50193995
Substrate
Meas. Tech.
ChEMBL_774326 (CHEMBL1908543)
Kd
>10000±n/a nM
Citation
 Davis, MIHunt, JPHerrgard, SCiceri, PWodicka, LMPallares, GHocker, MTreiber, DKZarrinkar, PP Comprehensive analysis of kinase inhibitor selectivity. Nat Biotechnol 29:1046-51 (2011)  
Target
Name:
Casein kinase I isoform alpha
Synonyms:
CK1 CSNK1A1 Casein kinase 1 alpha (CK1 alpha) KC1A_HUMAN
Type:
Serine/threonine-protein kinase
Mol. Mass.:
38936.59
Organism:
Homo sapiens (Human)
Description:
P48729
Residue:
337
  
Inhibitor
Name:
BDBM50193995
Synonyms:
3-((3R,4R)-4-methyl-3-(methyl(7H-pyrrolo[2,3-d]pyrimidin-4-yl)amino)piperidin-1-yl)-3-oxopropanenitrile 3-{(3R,4R)-4-methyl-3-[methyl(7H-pyrrolo[2,3-d]pyrimidin-4-yl)amino]piperidin-1-yl}-3-oxopropanenitrile CP-690550 Tofacitinib US10112907, Example 00035 US10766894, Compound TABLE 1.20 US11078206, Example Tofacitinib US11339167, Example Tofacitinib
Type:
Small organic molecule
Emp. Form.:
C16H20N6O
Mol. Mass.:
312.3696
SMILES:
C[C@@H]1CCN(C[C@@H]1N(C)c1ncnc2[nH]ccc12)C(=O)CC#N
: