Target
High affinity nerve growth factor receptor
Ligand
BDBM50300690
Substrate
Meas. Tech.
ChEMBL_774288 (CHEMBL1908505)
Kd
2300±n/a nM
Citation
 Davis, MIHunt, JPHerrgard, SCiceri, PWodicka, LMPallares, GHocker, MTreiber, DKZarrinkar, PP Comprehensive analysis of kinase inhibitor selectivity. Nat Biotechnol 29:1046-51 (2011)  
Target
Name:
High affinity nerve growth factor receptor
Synonyms:
2.7.10.1 NTRK1 NTRK1_HUMAN Neurotrophic tyrosine kinase receptor type 1 Synonyms=MTC TRK1-transforming tyrosine kinase protein TRKA GN Tropomyosin alpha-3 chain/High affinity nerve growth factor receptor Tropomyosin-related kinase A (TrkA) Tyrosine kinase receptor (Trk) Tyrosine kinase receptor A (Trk A) Tyrosine kinase receptor A (TrkA) p140-TrkA
Type:
Mol. Mass.:
87498.18
Organism:
Homo sapiens (Human)
Description:
P04629
Residue:
796
  
Inhibitor
Name:
BDBM50300690
Synonyms:
1-(5-Tert-Butyl-1,2-Oxazol-3-Yl)-3-(4-{7-[2-(Morpholin-4-Yl)ethoxy]imidazo[2,1-B][1,3]benzothiazol-2-Yl}phenyl)urea AC 220 AC010220 ASP-2689 N-(5-tert-Butyl-isoxazol-3-yl)-N'-{4-[7-(2-morpholin-4-yl-ethoxy)imidazo[2,1-b][1,3]benzothiazol-2-yl]phenyl}urea Quizartinib (AC220) US11542261, Compound quizartinib | US9216997, Quizartinib (positive compound)
Type:
Small organic molecule
Emp. Form.:
C29H32N6O4S
Mol. Mass.:
560.667
SMILES:
CC(C)(C)c1cc(NC(=O)Nc2ccc(cc2)-c2cn3c(n2)sc2cc(OCCN4CCOCC4)ccc32)no1
: