Target
Citron Rho-interacting kinase
Ligand
BDBM50355504
Substrate
Meas. Tech.
ChEMBL_774545 (CHEMBL1908762)
Kd
3200±n/a nM
Citation
 Davis, MIHunt, JPHerrgard, SCiceri, PWodicka, LMPallares, GHocker, MTreiber, DKZarrinkar, PP Comprehensive analysis of kinase inhibitor selectivity. Nat Biotechnol 29:1046-51 (2011)  
Target
Name:
Citron Rho-interacting kinase
Synonyms:
CIT CTRO_HUMAN STK21
Type:
PROTEIN
Mol. Mass.:
231428.89
Organism:
Homo sapiens (Human)
Description:
ChEMBL_774545
Residue:
2027
  
Inhibitor
Name:
BDBM50355504
Synonyms:
CHEMBL1908393
Type:
Small organic molecule
Emp. Form.:
C34H36F2N4O6
Mol. Mass.:
634.6696
SMILES:
COc1cc2c(Oc3ccc(NC(=O)C4(CC4)C(=O)NC4=CCC(F)C=C4)cc3F)ccnc2cc1OCCCN1CCOCC1
: