Target
Mitogen-activated protein kinase kinase kinase 13
Ligand
BDBM25084
Substrate
Meas. Tech.
ChEMBL_774445 (CHEMBL1908662)
Kd
>10000±n/a nM
Citation
 Davis, MIHunt, JPHerrgard, SCiceri, PWodicka, LMPallares, GHocker, MTreiber, DKZarrinkar, PP Comprehensive analysis of kinase inhibitor selectivity. Nat Biotechnol 29:1046-51 (2011)  
Target
Name:
Mitogen-activated protein kinase kinase kinase 13
Synonyms:
LZK M3K13_HUMAN MLK | Mixed lineage kinase
Type:
PROTEIN
Mol. Mass.:
108293.85
Organism:
Homo sapiens (Human)
Description:
ChEMBL_774445
Residue:
966
  
Inhibitor
Name:
BDBM25084
Synonyms:
3-[2,4-diamino-6-(3-hydroxyphenyl)pteridin-7-yl]phenol TG100-115
Type:
Small organic molecule
Emp. Form.:
C18H14N6O2
Mol. Mass.:
346.3428
SMILES:
Nc1nc(N)c2nc(-c3cccc(O)c3)c(nc2n1)-c1cccc(O)c1
: