Target
Serine/threonine-protein kinase TAO2
Ligand
BDBM5446
Substrate
Meas. Tech.
ChEMBL_774579 (CHEMBL1908796)
Kd
>10000±n/a nM
Citation
 Davis, MIHunt, JPHerrgard, SCiceri, PWodicka, LMPallares, GHocker, MTreiber, DKZarrinkar, PP Comprehensive analysis of kinase inhibitor selectivity. Nat Biotechnol 29:1046-51 (2011)  
Target
Name:
Serine/threonine-protein kinase TAO2
Synonyms:
KIAA0881 PSK TAOK2 | TAOK2_HUMAN
Type:
Enzyme
Mol. Mass.:
138262.36
Organism:
Homo sapiens (Human)
Description:
Q9UL54
Residue:
1235
  
Inhibitor
Name:
BDBM5446
Synonyms:
CHEMBL553 Erlotinib N-(3-Ethynylphenyl)-6,7-bis(2-methoxyethoxy)-4-quinazolinamine Monohydrochloride OSI-774 US10189853, erlotinib US11524945, Compound Erlotinib US9730934, Erlotinib cid_176870
Type:
Small organic molecule
Emp. Form.:
C22H23N3O4
Mol. Mass.:
393.4357
SMILES:
COCCOc1cc2ncnc(Nc3cccc(c3)C#C)c2cc1OCCOC
: