Target
Hormonally up-regulated neu tumor-associated kinase
Ligand
BDBM482158
Substrate
Meas. Tech.
ChEMBL_774564 (CHEMBL1908781)
Kd
350±n/a nM
Citation
 Davis, MIHunt, JPHerrgard, SCiceri, PWodicka, LMPallares, GHocker, MTreiber, DKZarrinkar, PP Comprehensive analysis of kinase inhibitor selectivity. Nat Biotechnol 29:1046-51 (2011)  
Target
Name:
Hormonally up-regulated neu tumor-associated kinase
Synonyms:
B19 HUNK_HUMAN Serine/threonine-protein kinase MAK-V
Type:
PROTEIN
Mol. Mass.:
79715.88
Organism:
Homo sapiens (Human)
Description:
ChEMBL_774564
Residue:
714
  
Inhibitor
Name:
BDBM482158
Synonyms:
BDBM50242742 | TAE684
Type:
Emp. Form.:
C30H40ClN7O3S
Mol. Mass.:
614.202
SMILES:
COc1cc(ccc1Nc1ncc(Cl)c(Nc2ccccc2S(=O)(=O)C(C)C)n1)N1CCC(CC1)N1CCN(C)CC1
: