Target
Cyclin-dependent kinase-like 3
Ligand
BDBM50309910
Substrate
Meas. Tech.
ChEMBL_774302 (CHEMBL1908519)
Kd
>10000±n/a nM
Citation
 Davis, MIHunt, JPHerrgard, SCiceri, PWodicka, LMPallares, GHocker, MTreiber, DKZarrinkar, PP Comprehensive analysis of kinase inhibitor selectivity. Nat Biotechnol 29:1046-51 (2011)  
Target
Name:
Cyclin-dependent kinase-like 3
Synonyms:
CDKL3 NKIAMRE | Serine/threonine-protein kinase NKIAMRE
Type:
PROTEIN
Mol. Mass.:
67544.66
Organism:
Homo sapiens (Human)
Description:
ChEMBL_774302
Residue:
592
  
Inhibitor
Name:
BDBM50309910
Synonyms:
CHEMBL608154 N-(6-chloro-7-methoxy-9H-pyrido[3,4-b]indol-8-yl)-2-methylnicotinamide
Type:
Small organic molecule
Emp. Form.:
C19H15ClN4O2
Mol. Mass.:
366.801
SMILES:
COc1c(Cl)cc2c3ccncc3[nH]c2c1NC(=O)c1cccnc1C
: