Target
Homeodomain-interacting protein kinase 3
Ligand
BDBM50355494
Substrate
Meas. Tech.
ChEMBL_774503 (CHEMBL1908720)
Kd
>10000±n/a nM
Citation
 Davis, MIHunt, JPHerrgard, SCiceri, PWodicka, LMPallares, GHocker, MTreiber, DKZarrinkar, PP Comprehensive analysis of kinase inhibitor selectivity. Nat Biotechnol 29:1046-51 (2011)  
Target
Name:
Homeodomain-interacting protein kinase 3
Synonyms:
DYRK6 HIPK3 PKY
Type:
PROTEIN
Mol. Mass.:
133763.81
Organism:
Homo sapiens (Human)
Description:
ChEMBL_774503
Residue:
1215
  
Inhibitor
Name:
BDBM50355494
Synonyms:
CHEMBL1908396
Type:
Small organic molecule
Emp. Form.:
C24H24N4O5S
Mol. Mass.:
480.536
SMILES:
COc1cc(Oc2ccnc3cc(OC)c(OC)cc23)ccc1NC(=O)NC(C)c1nccs1
: