Target
Mitogen-activated protein kinase kinase kinase 13
Ligand
BDBM25118
Substrate
Meas. Tech.
ChEMBL_774445 (CHEMBL1908662)
Kd
170±n/a nM
Citation
 Davis, MIHunt, JPHerrgard, SCiceri, PWodicka, LMPallares, GHocker, MTreiber, DKZarrinkar, PP Comprehensive analysis of kinase inhibitor selectivity. Nat Biotechnol 29:1046-51 (2011)  
Target
Name:
Mitogen-activated protein kinase kinase kinase 13
Synonyms:
LZK M3K13_HUMAN MLK | Mixed lineage kinase
Type:
PROTEIN
Mol. Mass.:
108293.85
Organism:
Homo sapiens (Human)
Description:
ChEMBL_774445
Residue:
966
  
Inhibitor
Name:
BDBM25118
Synonyms:
(3Z)-4-amino-5-fluoro-3-[5-(4-methylpiperazino)-1,3-dihydrobenzimidazol-2-ylidene]carbostyril CHEMBL522892 | CHIR-258
Type:
Small organic molecule
Emp. Form.:
C21H21FN6O
Mol. Mass.:
392.4294
SMILES:
CN1CCN(CC1)c1ccc2nc([nH]c2c1)-c1c(N)c2c(F)cccc2[nH]c1=O
: