Target
Cyclin-dependent kinase 2 homolog
Ligand
BDBM25028
Substrate
Meas. Tech.
ChEMBL_774240 (CHEMBL1908457)
Kd
>10000±n/a nM
Citation
 Davis, MIHunt, JPHerrgard, SCiceri, PWodicka, LMPallares, GHocker, MTreiber, DKZarrinkar, PP Comprehensive analysis of kinase inhibitor selectivity. Nat Biotechnol 29:1046-51 (2011)  
Target
Name:
Cyclin-dependent kinase 2 homolog
Synonyms:
CDK2H_PLAF7 Cell division control protein 2 homolog | PK5
Type:
PROTEIN
Mol. Mass.:
33000.81
Organism:
Plasmodium falciparum (isolate 3D7)
Description:
ChEMBL_774240
Residue:
288
  
Inhibitor
Name:
BDBM25028
Synonyms:
4-[2-(1H-indazol-4-yl)-6-[(4-methanesulfonylpiperazin-1-yl)methyl]thieno[3,2-d]pyrimidin-4-yl]morpholine GDC0941 US10851091, Compound pictilisib
Type:
Small organic molecule
Emp. Form.:
C23H27N7O3S2
Mol. Mass.:
513.636
SMILES:
CS(=O)(=O)N1CCN(Cc2cc3nc(nc(N4CCOCC4)c3s2)-c2cccc3[nH]ncc23)CC1
: