Target
Dual specificity mitogen-activated protein kinase kinase 7
Ligand
BDBM50355497
Substrate
Meas. Tech.
ChEMBL_774202 (CHEMBL1908419)
Kd
>10000±n/a nM
Citation
 Davis, MIHunt, JPHerrgard, SCiceri, PWodicka, LMPallares, GHocker, MTreiber, DKZarrinkar, PP Comprehensive analysis of kinase inhibitor selectivity. Nat Biotechnol 29:1046-51 (2011)  
Target
Name:
Dual specificity mitogen-activated protein kinase kinase 7
Synonyms:
Dual specificity mitogen-activated protein kinase kinase 7 JNKK2 MEK7 MP2K7_HUMAN SKK4
Type:
Protein
Mol. Mass.:
47502.52
Organism:
Homo sapiens (Human)
Description:
O14733
Residue:
419
  
Inhibitor
Name:
BDBM50355497
Synonyms:
AZD-6244 | CHEMBL1614701
Type:
Small organic molecule
Emp. Form.:
C17H15BrClFN4O3
Mol. Mass.:
457.681
SMILES:
Cn1cnc2c(F)c(Nc3ccc(Br)cc3Cl)c(cc12)C(=O)NOCCO
: