Target
Cyclin-dependent kinase-like 3
Ligand
BDBM24654
Substrate
Meas. Tech.
ChEMBL_774302 (CHEMBL1908519)
Kd
>10000±n/a nM
Citation
 Davis, MIHunt, JPHerrgard, SCiceri, PWodicka, LMPallares, GHocker, MTreiber, DKZarrinkar, PP Comprehensive analysis of kinase inhibitor selectivity. Nat Biotechnol 29:1046-51 (2011)  
Target
Name:
Cyclin-dependent kinase-like 3
Synonyms:
CDKL3 NKIAMRE | Serine/threonine-protein kinase NKIAMRE
Type:
PROTEIN
Mol. Mass.:
67544.66
Organism:
Homo sapiens (Human)
Description:
ChEMBL_774302
Residue:
592
  
Inhibitor
Name:
BDBM24654
Synonyms:
4-N-(2,6-dichlorobenzene)-3-N-(piperidin-4-yl)-1H-pyrazole-3,4-diamido JMC514986 Compound 33 | pyrazole diamide, 33
Type:
Small organic molecule
Emp. Form.:
C16H17Cl2N5O2
Mol. Mass.:
382.244
SMILES:
Clc1cccc(Cl)c1C(=O)Nc1cn[nH]c1C(=O)NC1CCNCC1
: