Target
Serine/threonine-protein kinase TAO2
Ligand
BDBM4851
Substrate
Meas. Tech.
ChEMBL_774579 (CHEMBL1908796)
Kd
>10000±n/a nM
Citation
 Davis, MIHunt, JPHerrgard, SCiceri, PWodicka, LMPallares, GHocker, MTreiber, DKZarrinkar, PP Comprehensive analysis of kinase inhibitor selectivity. Nat Biotechnol 29:1046-51 (2011)  
Target
Name:
Serine/threonine-protein kinase TAO2
Synonyms:
KIAA0881 PSK TAOK2 | TAOK2_HUMAN
Type:
Enzyme
Mol. Mass.:
138262.36
Organism:
Homo sapiens (Human)
Description:
Q9UL54
Residue:
1235
  
Inhibitor
Name:
BDBM4851
Synonyms:
(4-chlorophenyl)-[4-(4-pyridylmethyl)phthalazin-1-yl]amine CGP 79787 CHEMBL75232 N-(4-chlorophenyl)-4-(pyridin-4-ylmethyl)phthalazin-1-amine PTK787 cid_151194
Type:
Small organic molecule
Emp. Form.:
C20H15ClN4
Mol. Mass.:
346.813
SMILES:
Clc1ccc(Nc2nnc(Cc3ccncc3)c3ccccc23)cc1
: