Target
Activin receptor type-1B
Ligand
BDBM50237710
Substrate
Meas. Tech.
ChEMBL_774423 (CHEMBL1908640)
Kd
>10000±n/a nM
Citation
 Davis, MIHunt, JPHerrgard, SCiceri, PWodicka, LMPallares, GHocker, MTreiber, DKZarrinkar, PP Comprehensive analysis of kinase inhibitor selectivity. Nat Biotechnol 29:1046-51 (2011)  
Target
Name:
Activin receptor type-1B
Synonyms:
ACV1B_HUMAN ACVRLK4 Activin receptor type-1B/Activin receptor-like kinase 4 (ALK-4)
Type:
PROTEIN
Mol. Mass.:
56810.99
Organism:
Homo sapiens (Human)
Description:
ChEMBL_587064
Residue:
505
  
Inhibitor
Name:
BDBM50237710
Synonyms:
4-methyl-N-[3-(4-methyl-1H-imidazol-1-yl)-5-(trifluoromethyl)phenyl]-3-[(4-pyridin-3-ylpyrimidin-2-yl)amino]benzamide AMN107 NILOTINIB | US11649218, Example Nilotinib
Type:
Small organic molecule
Emp. Form.:
C28H22F3N7O
Mol. Mass.:
529.5158
SMILES:
Cc1cn(cn1)-c1cc(NC(=O)c2ccc(C)c(Nc3nccc(n3)-c3cccnc3)c2)cc(c1)C(F)(F)F
: