Target
Mitogen-activated protein kinase 4
Ligand
BDBM25919
Substrate
Meas. Tech.
ChEMBL_774366 (CHEMBL1908583)
Kd
>10000±n/a nM
Citation
 Davis, MIHunt, JPHerrgard, SCiceri, PWodicka, LMPallares, GHocker, MTreiber, DKZarrinkar, PP Comprehensive analysis of kinase inhibitor selectivity. Nat Biotechnol 29:1046-51 (2011)  
Target
Name:
Mitogen-activated protein kinase 4
Synonyms:
ERK4 MK04_HUMAN PRKM4
Type:
Enzyme Catalytic Domain
Mol. Mass.:
65906.37
Organism:
Homo sapiens (Human)
Description:
gi_89276769
Residue:
587
  
Inhibitor
Name:
BDBM25919
Synonyms:
BMS-345541 CHEMBL471496 | N-(2-aminoethyl)-3,12-dimethyl-2,5,8-triazatricyclo[7.4.0.0^{2,6}]trideca-1(13),3,5,7,9,11-hexaen-7-amine
Type:
Small organic molecule
Emp. Form.:
C14H17N5
Mol. Mass.:
255.3183
SMILES:
Cc1cnc2c(NCCN)nc3ccc(C)cc3n12
: